Target
Nuclear receptor subfamily 5 group A member 2
Ligand
BDBM95526
Substrate
IC50
5109±n/a nM
Citation
 PubChem, PC Luminescence-based cell-based high throughput dose response assay for inverse agonists of the liver receptor homolog-1 (LRH-1; NR5A2) PubChem Bioassay (2013)[AID] 
Target
Name:
Nuclear receptor subfamily 5 group A member 2
Synonyms:
Alpha-1-fetoprotein transcription factor B1F CYP7A promoter-binding factor Hepatocytic transcription factor Liver Receptor Homolog 1 NR5A2_HUMAN hB1F | nuclear receptor subfamily 5 group A member 2 isoform 2
Type:
Nuclear Hormone Receptor
Mol. Mass.:
61341.37
Organism:
Homo sapiens (Human)
Description:
Residue:
541
  
Inhibitor
Name:
BDBM95526
Synonyms:
4-[2-[[2-[(2-methylphenyl)amino]-2-oxidanylidene-ethyl]-propyl-amino]ethanoylamino]benzamide 4-[[2-[[2-(2-methylanilino)-2-oxoethyl]-propylamino]acetyl]amino]benzamide MLS000878101 cid_2522096
Type:
Small organic molecule
Emp. Form.:
C21H26N4O3
Mol. Mass.:
382.4561
SMILES:
CCCN(CC(=O)Nc1ccc(cc1)C(N)=O)CC(=O)Nc1ccccc1C
: