Target
Nuclear receptor subfamily 5 group A member 2
Ligand
BDBM95530
Substrate
IC50
4160±n/a nM
Citation
 PubChem, PC Luminescence-based cell-based high throughput dose response assay for inverse agonists of the liver receptor homolog-1 (LRH-1; NR5A2) PubChem Bioassay (2013)[AID] 
Target
Name:
Nuclear receptor subfamily 5 group A member 2
Synonyms:
Alpha-1-fetoprotein transcription factor B1F CYP7A promoter-binding factor Hepatocytic transcription factor Liver Receptor Homolog 1 NR5A2_HUMAN hB1F | nuclear receptor subfamily 5 group A member 2 isoform 2
Type:
Nuclear Hormone Receptor
Mol. Mass.:
61341.37
Organism:
Homo sapiens (Human)
Description:
Residue:
541
  
Inhibitor
Name:
BDBM95530
Synonyms:
5-nitro-N-(2-oxidanyl-5-sulfamoyl-phenyl)furan-2-carboxamide N-(2-hydroxy-5-sulfamoyl-phenyl)-5-nitro-2-furamide N-(2-hydroxy-5-sulfamoylphenyl)-5-nitrofuran-2-carboxamide cid_3648622
Type:
Small organic molecule
Emp. Form.:
C11H9N3O7S
Mol. Mass.:
327.27
SMILES:
NS(=O)(=O)c1ccc(O)c(NC(=O)c2ccc(o2)[N+]([O-])=O)c1
: