Target
Nuclear receptor subfamily 5 group A member 2
Ligand
BDBM95591
Substrate
IC50
>3985±n/a nM
Citation
 PubChem, PC Luminescence-based cell-based high throughput dose response assay for inverse agonists of the liver receptor homolog-1 (LRH-1; NR5A2) PubChem Bioassay (2013)[AID] 
Target
Name:
Nuclear receptor subfamily 5 group A member 2
Synonyms:
Alpha-1-fetoprotein transcription factor B1F CYP7A promoter-binding factor Hepatocytic transcription factor Liver Receptor Homolog 1 NR5A2_HUMAN hB1F | nuclear receptor subfamily 5 group A member 2 isoform 2
Type:
Nuclear Hormone Receptor
Mol. Mass.:
61341.37
Organism:
Homo sapiens (Human)
Description:
Residue:
541
  
Inhibitor
Name:
BDBM95591
Synonyms:
1-[1-oxo-2-[(6-oxo-7,8,9,10-tetrahydrobenzo[c][1]benzopyran-3-yl)oxy]ethyl]-4-piperidinecarboxamide 1-[2-[(6-oxidanylidene-7,8,9,10-tetrahydrobenzo[c]chromen-3-yl)oxy]ethanoyl]piperidine-4-carboxamide MLS001140567 cid_1769385
Type:
Small organic molecule
Emp. Form.:
C21H24N2O5
Mol. Mass.:
384.4257
SMILES:
NC(=O)C1CCN(CC1)C(=O)COc1ccc2c3CCCCc3c(=O)oc2c1
: