Target
Low molecular weight phosphotyrosine protein phosphatase
Ligand
BDBM58771
Substrate
IC50
>80000±n/a nM
Citation
 PubChem, PC Dose response confirmation of small molecule inhibitors of Low Molecular Weight Protein Tyrosine Phosphatase, LMPTP, in an orthogonal absorbance-based assay PubChem Bioassay (2013)[AID] 
Target
Name:
Low molecular weight phosphotyrosine protein phosphatase
Synonyms:
3.1.3.2 ACP1 LMW-PTP LMWPTP PPAC_HUMAN low molecular weight phosphotyrosine protein phosphatase isoform c
Type:
Mol. Mass.:
18042.81
Organism:
Homo sapiens (Human)
Description:
P24666
Residue:
158
  
Inhibitor
Name:
BDBM58771
Synonyms:
7-[4-[(3,5-dimethoxybenzoyl)carbamothioyl]piperazin-1-yl]-1-ethyl-6-fluoro-4-oxoquinoline-3-carboxylic acid 7-[4-[(3,5-dimethoxyphenyl)carbonylcarbamothioyl]piperazin-1-yl]-1-ethyl-6-fluoranyl-4-oxidanylidene-quinoline-3-carboxylic acid MLS001075342 cid_4640068
Type:
Small organic molecule
Emp. Form.:
C26H27FN4O6S
Mol. Mass.:
542.579
SMILES:
CCn1cc(C(O)=O)c(=O)c2cc(F)c(cc12)N1CCN(CC1)C(=S)NC(=O)c1cc(OC)cc(OC)c1
: