Target
Low molecular weight phosphotyrosine protein phosphatase
Ligand
BDBM29680
Substrate
IC50
>80000±n/a nM
Citation
 PubChem, PC Dose response confirmation of small molecule inhibitors of Low Molecular Weight Protein Tyrosine Phosphatase, LMPTP, in an orthogonal absorbance-based assay PubChem Bioassay (2013)[AID] 
Target
Name:
Low molecular weight phosphotyrosine protein phosphatase
Synonyms:
3.1.3.2 ACP1 LMW-PTP LMWPTP PPAC_HUMAN low molecular weight phosphotyrosine protein phosphatase isoform c
Type:
Mol. Mass.:
18042.81
Organism:
Homo sapiens (Human)
Description:
P24666
Residue:
158
  
Inhibitor
Name:
BDBM29680
Synonyms:
2-[(6,7-dihydroxy-2-keto-chromen-4-yl)methylthio]-3-(3-methoxyphenyl)quinazolin-4-one 2-[(6,7-dihydroxy-2-oxochromen-4-yl)methylsulfanyl]-3-(3-methoxyphenyl)quinazolin-4-one MLS000409303 cid_5691857
Type:
Small organic molecule
Emp. Form.:
C25H18N2O6S
Mol. Mass.:
474.485
SMILES:
COc1cccc(c1)-n1c(SCc2cc(=O)oc3cc(O)c(O)cc23)nc2ccccc2c1=O
: