Target
T cell receptor alpha variable 4
Ligand
BDBM83190
Substrate
IC50
>94106±n/a nM
Citation
 PubChem, PC Fluorescence-based biochemical primary high throughput dose response assay to identify inhibitors of T-cell receptor (TCR)-CD3 interaction using a TAMRA-labeled TCR probe PubChem Bioassay (2013)[AID] 
Target
Name:
T cell receptor alpha variable 4
Synonyms:
TCRAV4S1 TVA4_HUMAN
Type:
Enzyme Catalytic Domain
Mol. Mass.:
12216.28
Organism:
Homo sapiens (Human)
Description:
A0A0B4J268
Residue:
109
  
Inhibitor
Name:
BDBM83190
Synonyms:
(3Z)-3-(2-furanylmethylidene)-1,2-dihydrocyclopenta[b]quinoline-9-carboxylic acid [2-[2-cyanoethyl(methyl)amino]-2-oxoethyl] ester MLS002634234 [2-[2-cyanoethyl(methyl)amino]-2-oxidanylidene-ethyl] (3Z)-3-(furan-2-ylmethylidene)-1,2-dihydrocyclopenta[b]quinoline-9-carboxylate cid_44825359
Type:
Small organic molecule
Emp. Form.:
C24H21N3O4
Mol. Mass.:
415.4412
SMILES:
CN(CCC#N)C(=O)COC(=O)c1c2CC\C(=C\c3ccco3)c2nc2ccccc12
: