Target
Huntingtin
Ligand
BDBM50256
Substrate
IC50
721.08±n/a nM
Citation
 PubChem, PC Fluorescence-based biochemical high throughput dose response assay to identify molecules that bind r(CAG) RNA repeats PubChem Bioassay (2013)[AID] 
Target
Name:
Huntingtin
Synonyms:
HD HD_HUMAN Homo sapiens huntingtin (HTT), mRNA Huntington disease protein | IT15
Type:
PROTEIN
Mol. Mass.:
347579.69
Organism:
Homo sapiens (Human)
Description:
EBI_101216
Residue:
3142
  
Inhibitor
Name:
BDBM50256
Synonyms:
(5E)-1-butyl-5-[(E)-3-(2-furanyl)prop-2-enylidene]-2-sulfanylidene-1,3-diazinane-4,6-dione (5E)-1-butyl-5-[(E)-3-(furan-2-yl)prop-2-enylidene]-2-sulfanylidene-1,3-diazinane-4,6-dione MLS000587066 cid_1595371
Type:
Small organic molecule
Emp. Form.:
C15H16N2O3S
Mol. Mass.:
304.364
SMILES:
CCCCN1C(=S)NC(=O)\C(=C/C=C/c2ccco2)C1=O
: