Target
Platelet-derived growth factor receptor beta
Ligand
BDBM3096
Substrate
Poly(E:Y)
Meas. Tech.
Kinase Inhibition Assay
IC50
79±n/a nM
Citation
 Boschelli, DHWu, ZKlutchko, SRShowalter, HDHamby, JMLu, GHMajor, TCDahring, TKBatley, BPanek, RLKeiser, JHartl, BGKraker, AJKlohs, WDRoberts, BJPatmore, SElliott, WLSteinkampf, RBradford, LAHallak, HDoherty, AM Synthesis and tyrosine kinase inhibitory activity of a series of 2-amino-8H-pyrido[2,3-d]pyrimidines: identification of potent, selective platelet-derived growth factor receptor tyrosine kinase inhibitors. J Med Chem 41:4365-77 (1998)  
Target
Name:
Platelet-derived growth factor receptor beta
Synonyms:
Beta-type platelet-derived growth factor receptor CD140b antigen PDGF Receptor Substrate PDGFR PDGFR-1 PDGFRB PGFRB_HUMAN Platelet-derived growth factor receptor 1 Platelet-derived growth factor receptor beta (PDGFR-beta) Platelet-derived growth factor receptor beta (PDGFRbeta) | VHL/PDGFRB
Type:
Enzyme
Mol. Mass.:
123922.25
Organism:
Homo sapiens (Human)
Description:
P09619
Residue:
1106
  
Inhibitor
Name:
BDBM3096
Synonyms:
2-aminopyrido[2,3-d]pyrimidin-7(8H)-one deriv. 6-(2,6-dichlorophenyl)-2-({4-[2-(diethylamino)ethoxy]phenyl}amino)-8-methyl-7H,8H-pyrido[2,3-d]pyrimidin-7-one D3RKN_84 | PD166285
Type:
Small organic molecule
Emp. Form.:
C26H27Cl2N5O2
Mol. Mass.:
512.431
SMILES:
CCN(CC)CCOc1ccc(Nc2ncc3cc(-c4c(Cl)cccc4Cl)c(=O)n(C)c3n2)cc1
:
Substrate
Name:
Poly(E:Y)
Synonyms:
Type:
Random polymer
Mol. Mass.:
358.43
Organism:
Description:
Random copolymer of glutamic acid and tyrosine (4:1). 50 uM ATP containing 0.4 uCi of [gamma-32P]ATP as co-substrate
Residue:
3
NA