Target
Trace amine-associated receptor 1
Ligand
BDBM36895
Substrate
IC50
827.75±n/a nM
Citation
 PubChem, PC Counterscreen for agonists of the human trace amine associated receptor 1 (hTAAR1): Fluorescence-based cell-based high throughput dose response assay to identify hTAAR1 agonist that also desensitize TAAR1 receptor response. PubChem Bioassay (2013)[AID] 
Target
Name:
Trace amine-associated receptor 1
Synonyms:
TA1 TAAR1_HUMAN TRAR1 | trace amine-associated receptor 1
Type:
PROTEIN
Mol. Mass.:
39107.47
Organism:
Homo sapiens (Human)
Description:
ChEMBL_792734
Residue:
339
  
Inhibitor
Name:
BDBM36895
Synonyms:
1-(2,3-dihydro-1,4-benzodioxin-6-yl)-3-(1,2,4,5-tetrahydro-3-benzazepin-3-yl)-1-propanone;hydrochloride MLS000069261 cid_2893616
Type:
Small organic molecule
Emp. Form.:
C21H23NO3
Mol. Mass.:
337.4122
SMILES:
O=C(CCN1CCc2ccccc2CC1)c1ccc2OCCOc2c1
: