Target
Trace amine-associated receptor 1
Ligand
BDBM96899
Substrate
IC50
1094±n/a nM
Citation
 PubChem, PC Fluorescence-based cell-based high throughput dose response assay to identify antagonists of the human trace amine associated receptor 1 (TAAR1) PubChem Bioassay (2013)[AID] 
Target
Name:
Trace amine-associated receptor 1
Synonyms:
TA1 TAAR1_HUMAN TRAR1 | trace amine-associated receptor 1
Type:
PROTEIN
Mol. Mass.:
39107.47
Organism:
Homo sapiens (Human)
Description:
ChEMBL_792734
Residue:
339
  
Inhibitor
Name:
BDBM96899
Synonyms:
3'-methyl-2'-spiro[1,3-dithiolane-2,4'-6,7-dihydro-5H-benzofuran]carboxylic acid methyl ester MLS000066906 cid_1248737 methyl 3-methyl-6,7-dihydro-5H-spiro[1-benzofuran-4,2'-[1,3]dithiolane]-2-carboxylate
Type:
Small organic molecule
Emp. Form.:
C13H16O3S2
Mol. Mass.:
284.394
SMILES:
COC(=O)c1oc2CCCC3(SCCS3)c2c1C
: