Target
Nuclear receptor subfamily 0 group B member 1
Ligand
BDBM19149
Substrate
IC50
747.17±n/a nM
Citation
 PubChem, PC Luminescence-based cell-based high throughput dose response assay for inhibitors of the orphan nuclear receptor subfamily 0, group B, member 1 (DAX1; NR0B1): repression of SF-1 (NR5A1) activated StAR promoter by full-length DAX-1 PubChem Bioassay (2013)[AID] 
Target
Name:
Nuclear receptor subfamily 0 group B member 1
Synonyms:
AHC NR0B1 | NR0B1_HUMAN
Type:
Enzyme Catalytic Domain
Mol. Mass.:
51729.22
Organism:
Homo sapiens (Human)
Description:
gi_5016090
Residue:
470
  
Inhibitor
Name:
BDBM19149
Synonyms:
CHEMBL98 SAHA US10188756, Compound SAHA US11505523, Compound SAHA US9353061, SAHA US9695181, Vorinostat Zolinza suberoylanilide hydroxamic acid
Type:
Small organic molecule
Emp. Form.:
C14H20N2O3
Mol. Mass.:
264.3202
SMILES:
ONC(=O)CCCCCCC(=O)Nc1ccccc1
: