Target
Tyrosine-protein kinase BTK
Ligand
BDBM97673
Substrate
Meas. Tech.
In Vitro Inhibition Assay
pH
7.4±0
IC50
0.52±0.0 nM
Citation
 Honigberg, LVerner, EPan, Z Inhibitors of Bruton's tyrosine kinase US Patent  US8476284 Publication Date 7/2/2013 
Target
Name:
Tyrosine-protein kinase BTK
Synonyms:
AGMX1 Agammaglobulinaemia tyrosine kinase B cell progenitor kinase BPK BTK_HUMAN Tyrosine Kinase BTK Tyrosine-protein kinase BTK (BTK)
Type:
Enzyme
Mol. Mass.:
76289.95
Organism:
Homo sapiens (Human)
Description:
Q06187
Residue:
659
  
Inhibitor
Name:
BDBM97673
Synonyms:
US8476284, 41 | US8497277, 6
Type:
Small organic molecule
Emp. Form.:
C24H24N6O3S
Mol. Mass.:
476.551
SMILES:
Nc1ncnc2n(nc(-c3ccc(Oc4ccccc4)cc3)c12)C1CCCN(C1)S(=O)(=O)C=C
: