Target
Proto-oncogene tyrosine-protein kinase Src
Ligand
BDBM50198821
Substrate
Meas. Tech.
Luciferase-Based Assay
Temperature
298.15±n/a K
IC50
788±0 nM
Comments
extracted
Citation
 Gong, XBarrett, KCao, JGritzen, CNoronha, GHood, JDMak, CCMcPherson, APathak, VPRenick, JSoll, RMSplittgerber, UWrasidlo, WZeng, BZhao, NDneprovskaia, E Benzotriazine inhibitors of kinases US Patent  US8481536 Publication Date 7/9/2013 
Target
Name:
Proto-oncogene tyrosine-protein kinase Src
Synonyms:
Calmodulin/Proto-oncogene tyrosine-protein kinase Src Proto-oncogene c-Src SRC SRC_HUMAN V-src sarcoma (Schmidt-Ruppin A-2) viral oncogene homolog (avian) p60-Src | pp60c-src
Type:
Protein
Mol. Mass.:
59838.60
Organism:
Homo sapiens (Human)
Description:
P12931
Residue:
536
  
Inhibitor
Name:
BDBM50198821
Synonyms:
7-(2-chloro-5-methoxyphenyl)-5-methyl-N-(4-(2-(pyrrolidin-1-yl)ethoxy)phenyl)benzo[e][1,2,4]triazin-3-amine US8481536, 396
Type:
Small organic molecule
Emp. Form.:
C27H28ClN5O2
Mol. Mass.:
489.997
SMILES:
COc1ccc(Cl)c(c1)-c1cc(C)c2nc(Nc3ccc(OCCN4CCCC4)cc3)nnc2c1
: