Target
Prothrombin
Ligand
BDBM98596
Substrate
Meas. Tech.
Enzyme Assay
Temperature
297.15±0 K
Ki
7900±0.0 nM
Citation
 Stuerzebecher, JSteinmetzer, TSchweinitz, A Urokinase inhibitors, production and use thereof US Patent  US8476306 Publication Date 7/2/2013 
Target
Name:
Prothrombin
Synonyms:
Activated blood-coagulation factor II Activation peptide fragment 2 Blood-coagulation factor IIa E thrombin Factor IIa Gamma-thrombin THRB_RAT Thrombin Thrombin light chain Thrombofort | Tropostasin
Type:
Protein
Mol. Mass.:
70413.05
Organism:
Rattus norvegicus
Description:
P18292
Residue:
617
  
Inhibitor
Name:
BDBM98596
Synonyms:
(2R)-N-[2-[(4-carbamimidoylphenyl)methylamino]-2-oxo-ethyl]-2-[(4-fluorophenyl)methylsulfonylamino]-3-hydroxy-propanamide | US8476306, 6.22
Type:
Small organic molecule
Emp. Form.:
C20H24FN5O5S
Mol. Mass.:
465.498
SMILES:
NC(=N)c1ccc(CNC(=O)CNC(=O)[C@@H](CO)NS(=O)(=O)Cc2ccc(F)cc2)cc1
: