Target
Serine protease 1
Ligand
BDBM98584
Substrate
Meas. Tech.
Enzyme Assay
Temperature
297.15±0 K
Ki
21±0.0 nM
Citation
 Stuerzebecher, JSteinmetzer, TSchweinitz, A Urokinase inhibitors, production and use thereof US Patent  US8476306 Publication Date 7/2/2013 
Target
Name:
Serine protease 1
Synonyms:
PTRYI RATPTRYI Trp1 Tryp1 | Trypsin
Type:
Protein
Mol. Mass.:
25951.67
Organism:
Rattus norvegicus
Description:
P00762
Residue:
246
  
Inhibitor
Name:
BDBM98584
Synonyms:
3-[[(1R)-2-[[(1S)-2-[(4-carbamimidoylphenyl)methylamino]-1-methyl-2-oxo-ethyl]amino]-1-(hydroxymethyl)-2-oxo-ethyl]sulfamoylmethyl]benzoic acid | US8476306, 6.9
Type:
Small organic molecule
Emp. Form.:
C22H27N5O7S
Mol. Mass.:
505.544
SMILES:
C[C@H](NC(=O)[C@@H](CO)NS(=O)(=O)Cc1cccc(c1)C(O)=O)C(=O)NCc1ccc(cc1)C(N)=N
: