Target
Serine protease 1
Ligand
BDBM98587
Substrate
Meas. Tech.
Enzyme Assay
Temperature
297.15±0 K
Ki
6.8±0.0 nM
Citation
 Stuerzebecher, JSteinmetzer, TSchweinitz, A Urokinase inhibitors, production and use thereof US Patent  US8476306 Publication Date 7/2/2013 
Target
Name:
Serine protease 1
Synonyms:
PTRYI RATPTRYI Trp1 Tryp1 | Trypsin
Type:
Protein
Mol. Mass.:
25951.67
Organism:
Rattus norvegicus
Description:
P00762
Residue:
246
  
Inhibitor
Name:
BDBM98587
Synonyms:
(2R)-N-[(1S)-1-(benzyloxymethyl)-2-[(4-carbamimidoylphenyl)methylamino]-2-oxo-ethyl]-2-(benzylsulfonylamino)-3-hydroxy-propanamide | US8476306, 6.13
Type:
Small organic molecule
Emp. Form.:
C28H33N5O6S
Mol. Mass.:
567.657
SMILES:
NC(=N)c1ccc(CNC(=O)[C@H](COCc2ccccc2)NC(=O)[C@@H](CO)NS(=O)(=O)Cc2ccccc2)cc1
: