Target
Adenosine receptor A2
Ligand
BDBM99210
Substrate
Meas. Tech.
Binding Assay
Ki
2270±0.0 nM
Citation
 Jagtap, P Adenosine compounds and their use thereof US Patent  US8501708 Publication Date 8/6/2013 
Target
Name:
Adenosine receptor A2
Synonyms:
Adenosine A2a receptor
Type:
Protein
Mol. Mass.:
44661.95
Organism:
Oryctolagus cuniculus (rabbit)
Description:
XP_002722612 (sequence modified)
Residue:
409
  
Inhibitor
Name:
BDBM99210
Synonyms:
US8501708, 34
Type:
Small organic molecule
Emp. Form.:
C24H31N5O5
Mol. Mass.:
469.5334
SMILES:
Cc1cccc(C)c1CO[C@@H]1CCCC1Nc1ncnc2n(cnc12)[C@@H]1O[C@H](CO)[C@@H](O)[C@H]1O
: