Target
Tyrosine-protein kinase JAK1
Ligand
BDBM100348
Substrate
Meas. Tech.
Binding Assay
Kd
6.7±0.0 nM
Citation
 Bauer, SMJia, ZJMehrotra, MSong, YXu, QHuang, WVenkataramani, CRose, JWPandey, A Inhibitors of protein kinases US Patent  US8501944 Publication Date 8/6/2013 
Target
Name:
Tyrosine-protein kinase JAK1
Synonyms:
JAK-1 JAK1A JAK1_HUMAN Janus kinase 1 (JAK1) | Janus kinase 1 JAK1
Type:
Protein
Mol. Mass.:
133293.73
Organism:
Homo sapiens (Human)
Description:
P23458
Residue:
1154
  
Inhibitor
Name:
BDBM100348
Synonyms:
US10533001, Example Table 9a.1 US8501944, 370 US9868729, Example 38
Type:
Small organic molecule
Emp. Form.:
C21H27N7O3
Mol. Mass.:
425.4842
SMILES:
COCC(=O)N1CCN(CC1)c1ccc(Nc2ncc(C(N)=O)c(NC3CC3)n2)cc1
: