Target
Epoxide hydrolase 1
Ligand
BDBM2197
Substrate
Meas. Tech.
Inhibition Assay
IC50
0.4±0.0 nM
Citation
 Hammock, BDJones, PDMorisseau, CHuang, HTsai, HGless, Jr., R Conformationally restricted urea inhibitors of soluble epoxide hydrolase US Patent  US8501783 Publication Date 8/6/2013 
Target
Name:
Epoxide hydrolase 1
Synonyms:
EPHX EPOX Epoxide hydrolase (HsEH) HYEP_HUMAN | Microsomal epoxide hydrolase
Type:
Protein
Mol. Mass.:
52954.28
Organism:
Homo sapiens (Human)
Description:
P07099
Residue:
455
  
Inhibitor
Name:
BDBM2197
Synonyms:
US8501783, 1591
Type:
Emp. Form.:
C20H19F6N3O4S
Mol. Mass.:
511.438
SMILES:
FC(F)(F)Oc1ccc(NC(=O)NC2CCN(CC2)S(=O)(=O)c2ccc(cc2)C(F)(F)F)cc1
: