Target
Pro-glucagon
Ligand
BDBM100829
Substrate
Meas. Tech.
Glucagon SPA Assay
pH
7.4±0
Ki
62.8±0.0 nM
Citation
 Aspnes, GEDidiuk, MTFilipski, KJGuzman-Perez, ALee, ECPfefferkorn, JAStevens, BDTu, MM Glucagon receptor modulators US Patent  US8507533 Publication Date 8/13/2013 
Target
Name:
Pro-glucagon
Synonyms:
GCG Glucagon | Glucagon receptor (GCGR)
Type:
Enzyme
Mol. Mass.:
20907.95
Organism:
Homo sapiens (Human)
Description:
P01275
Residue:
180
  
Inhibitor
Name:
BDBM100829
Synonyms:
US8507533, 140
Type:
Small organic molecule
Emp. Form.:
C27H26ClN3O4
Mol. Mass.:
491.966
SMILES:
CCCC(Oc1ccc(cc1)-n1cc2cc(Cl)ccc2n1)c1ccc(cc1)C(=O)NCCC(O)=O
: