Target
Pro-glucagon
Ligand
BDBM100837
Substrate
Meas. Tech.
Glucagon SPA Assay
pH
7.4±0
Ki
35.2±0.0 nM
Citation
 Aspnes, GEDidiuk, MTFilipski, KJGuzman-Perez, ALee, ECPfefferkorn, JAStevens, BDTu, MM Glucagon receptor modulators US Patent  US8507533 Publication Date 8/13/2013 
Target
Name:
Pro-glucagon
Synonyms:
GCG Glucagon | Glucagon receptor (GCGR)
Type:
Enzyme
Mol. Mass.:
20907.95
Organism:
Homo sapiens (Human)
Description:
P01275
Residue:
180
  
Inhibitor
Name:
BDBM100837
Synonyms:
US8507533, 152
Type:
Small organic molecule
Emp. Form.:
C29H32F3N3O4
Mol. Mass.:
543.5773
SMILES:
Cc1cc(OC(C2CC(C)(C)C2)c2ccc(cc2)C(=O)NCCC(O)=O)cc(C)c1-n1cc(cn1)C(F)(F)F
: