Target
Serine/threonine-protein kinase PAK 4
Ligand
BDBM101518
Substrate
Meas. Tech.
Enzymatic Assay
Ki
25±n/a nM
EC50
32±0 nM
Citation
 Zhang, JGuo, CBouzida, DDong, LLi, HMarakovits, JTYang, AHong, Y Pyrrolopyrazoles, potent kinase inhibitors US Patent  US8530652 Publication Date 9/10/2013 
Target
Name:
Serine/threonine-protein kinase PAK 4
Synonyms:
KIAA1142 PAK4_HUMAN | p21-Activated kinase 4 (PAK4)
Type:
Protein
Mol. Mass.:
64098.01
Organism:
Homo sapiens (Human)
Description:
O96013
Residue:
591
  
Inhibitor
Name:
BDBM101518
Synonyms:
US8524699, 46 US8530652, 90
Type:
Small organic molecule
Emp. Form.:
C24H22F3N7OS
Mol. Mass.:
513.538
SMILES:
CC1(C)N(Cc2c(Nc3nc(nc4ccsc34)C(F)(F)F)[nH]nc12)C(=O)N[C@@H]1C[C@H]1c1ccccc1
: