Target
Isoform 3 of Acetyl-CoA carboxylase 2 (ACC2.v2)
Ligand
BDBM101938
Substrate
Meas. Tech.
Enzyme Assay
IC50
1.4e+2±n/a nM
Citation
 Fleck, MNosse, BHeine, NRoth, GJ Azetidine derivatives US Patent  US8530460 Publication Date 9/10/2013 
Target
Name:
Isoform 3 of Acetyl-CoA carboxylase 2 (ACC2.v2)
Synonyms:
ACACB ACC2 Acetyl-CoA carboxylase 2 (ACC2) | Acetyl-CoA carboxylase 2 (ACC2.v2)
Type:
Protein
Mol. Mass.:
255085.30
Organism:
Homo sapiens (Human)
Description:
AJ575592.3
Residue:
2256
  
Inhibitor
Name:
BDBM101938
Synonyms:
US8530460, 1.18
Type:
Small organic molecule
Emp. Form.:
C24H30N2O4
Mol. Mass.:
410.506
SMILES:
C[C@H](NC(C)=O)c1ccc(OC2CN(C2)c2ccc3OCC(C)(C)COc3c2)cc1
: