Target
RAC-alpha serine/threonine-protein kinase
Ligand
BDBM102309
Substrate
Meas. Tech.
Kinase Assay
pH
7.5±0
IC50
10±0.0 nM
Citation
 Furuyama, HGoto, YKawanishi, NLayton, MEMita, TOgino, YOnozaki, YRossi, MASakamoto, TSanderson, PEWang, J Inhibitors of AKT activity US Patent  US8536193 Publication Date 9/17/2013 
Target
Name:
RAC-alpha serine/threonine-protein kinase
Synonyms:
AKT phosphorylation (p-AKT) AKT1/PPP1CA C-AKT PKB alpha Protein kinase B Protein kinase B (Akt 1) Protein kinase B alpha Proto-oncogene Akt (Akt1) Proto-oncogene c-Akt (AKT1) RAC-PK-alpha RAC-alpha serine/threonine-protein kinase (AKT1) | RAC-alpha serine/threonine-protein kinase (pAKT)
Type:
Enzyme
Mol. Mass.:
55681.25
Organism:
Homo sapiens (Human)
Description:
P31749
Residue:
480
  
Inhibitor
Name:
BDBM102309
Synonyms:
US8536193, 5-12
Type:
Small organic molecule
Emp. Form.:
C31H25F2N5
Mol. Mass.:
505.5605
SMILES:
NC1(CC(F)(F)C1)c1ccc(cc1)-c1nc2ccc(=N)n(C(=N)c3ccccc3)c2cc1-c1ccccc1
: