Target
RAC-beta serine/threonine-protein kinase
Ligand
BDBM102307
Substrate
Meas. Tech.
Kinase Assay
pH
7.5±0
IC50
24±0.0 nM
Citation
 Furuyama, HGoto, YKawanishi, NLayton, MEMita, TOgino, YOnozaki, YRossi, MASakamoto, TSanderson, PEWang, J Inhibitors of AKT activity US Patent  US8536193 Publication Date 9/17/2013 
Target
Name:
RAC-beta serine/threonine-protein kinase
Synonyms:
AKT2 PKB beta Protein kinase B (Akt 2) Protein kinase B, beta RAC-alpha serine/threonine-protein kinase (AKT2) RAC-beta serine/threonine-protein kinase (AKT2) Serine/threonine-protein kinase AKT2 | Serine/threonine-protein kinase Rac alpha/beta
Type:
Enzyme
Mol. Mass.:
55766.64
Organism:
Homo sapiens (Human)
Description:
Residue:
481
  
Inhibitor
Name:
BDBM102307
Synonyms:
US8536193, 3-1
Type:
Small organic molecule
Emp. Form.:
C25H24N6
Mol. Mass.:
408.4983
SMILES:
NC(=N)n1c2cc(-c3ccccc3)c(nc2ccc1=N)-c1ccc(cc1)C1(N)CCC1
: