Target
Tumor necrosis factor
Ligand
BDBM102855
Substrate
Meas. Tech.
Inhibition Assay
Ki
0.083±0.0 nM
IC50
65±0.0 nM
Citation
 Kozlowski, JAYu, WWong, MKKim, SHTong, LLavey, BJShankar, BBYang, DFeltz, RKosinski, AMZhou, GRizvi, RKDai, CFire, LGirijavallabhan, VLi, DPopovici-Muller, JRichard, JERosner, KESiddiqui, MAYang, L Compounds for the treatment of inflammatory disorders US Patent  US8541572 Publication Date 9/24/2013 
Target
Name:
Tumor necrosis factor
Synonyms:
Cachectin TNF-a TNFA TNFSF2 Tumor necrosis factor (TNFa) Tumor necrosis factor ligand superfamily member 2 Tumor necrosis factor, soluble form | tumor necrosis factor alpha
Type:
Enzyme
Mol. Mass.:
25645.11
Organism:
Homo sapiens (Human)
Description:
P01375
Residue:
233
  
Inhibitor
Name:
BDBM102855
Synonyms:
US8541572, 943
Type:
Small organic molecule
Emp. Form.:
C27H28N6O5
Mol. Mass.:
516.5484
SMILES:
COc1ccc2CN(C[C@]3(NC(=O)NC3=O)C#Cc3ccc(cc3)C(N=O)N3CCN(C)CC3)C(=O)c2c1
: