Target
Beta-secretase 1
Ligand
BDBM101027
Substrate
Meas. Tech.
Inhibition Assay
pH
7±0
IC50
8.7e+2±n/a nM
Citation
 Tamura, YSuzuki, STada, YFujikoshi, CMatsumoto, SKooriyama, Y Aminodihydrothiazine derivatives substituted with a cyclic group US Patent  US8541408 Publication Date 9/24/2013 
Target
Name:
Beta-secretase 1
Synonyms:
ASP2 Aspartyl protease 2 BACE1 Beta-secretase (BACE) Beta-secretase 1 (BACE 1) Beta-secretase 1 (BACE1) Beta-site amyloid precursor protein cleaving enzyme 1 Memapsin-2 beta-Secretase (BACE-1) | beta-Secretase (BACE1)
Type:
Protein
Mol. Mass.:
55755.10
Organism:
Homo sapiens (Human)
Description:
P56817
Residue:
501
  
Inhibitor
Name:
BDBM101027
Synonyms:
US8507479, 665
Type:
Small organic molecule
Emp. Form.:
C21H23F3N4OS
Mol. Mass.:
436.494
SMILES:
CCCCc1ccc(nc1)C(=O)Nc1ccc(F)c(c1)[C@@]1(C)N=C(N)SCC1(F)F
: