Target
Adhesin Ata autotransporter
Ligand
BDBM281035
Substrate
Meas. Tech.
Antimicrobial Susceptibility Testing Assay
IC50
<400±n/a nM
Citation
 Alanine, ABeignet, JBleicher, KFasching, BHilpert, HHu, TMacDonald, DJackson, SKolczewski, SKroll, CSchaeublin, AShen, HStoll, TThomas, HWahhab, AZampaloni, C Peptide macrocycles against acinetobacter baumannii US Patent  US10030047 Publication Date 7/24/2018 
Target
Name:
Adhesin Ata autotransporter
Synonyms:
ATA_ACIBT ata | ata:
Type:
Enzyme Catalytic Domain
Mol. Mass.:
189662.81
Organism:
Acinetobacter baumannii (strain ATCC 17978 / CIP 53.77 / LMG 1025 / NCDC KC755 / 5377)
Description:
A3M3H0
Residue:
1873
  
Inhibitor
Name:
BDBM281035
Synonyms:
(11S,14S,17S)-14-(4-Amino-butyl)-22-[3-(2-amino-ethyl)-phenyl]-11-(3-amino-propyl)-25-chloro-17-(1H-indol-3-ylmethyl)-16-methyl-2-thia-4,10,13,16,19-pentaaza-tricyclo[19.4.0.0*3,8*]pentacosa-1(25),3(8),4,6,21,23-hexaene-12,15,18-trione | US10030047, Example 244
Type:
Small organic molecule
Emp. Form.:
C44H54ClN9O3S
Mol. Mass.:
824.476
SMILES:
CN1[C@@H](Cc2c[nH]c3ccccc23)C(=O)NCc2c(Sc3ncccc3CN[C@@H](CCCN)C(=O)N[C@@H](CCCCN)C1=O)c(Cl)ccc2-c1cccc(CCN)c1
: