Target
Procathepsin L
Ligand
BDBM103359
Substrate
Meas. Tech.
In Vitro Inhibition Assay
Ki
>10000±0.0 nM
Citation
 Quibell, MWatts, JPFlinn, NS Furo[3, 2-B] pyrrol-3-ones as cathespin S inhibitors US Patent  US8552202 Publication Date 10/8/2013 
Target
Name:
Procathepsin L
Synonyms:
CATL1_HUMAN CTSL CTSL1 Cathepsin L Cathepsin L1 heavy chain MEP cathepsin L preproprotein
Type:
Enzyme
Mol. Mass.:
37557.19
Organism:
Homo sapiens (Human)
Description:
Purchased from Calbiochem (San Diego, CA).
Residue:
333
  
Inhibitor
Name:
BDBM103359
Synonyms:
US8552202, Compound 10
Type:
Small organic molecules
Emp. Form.:
C23H28N6O4
Mol. Mass.:
452.5062
SMILES:
C[C@H]1CC[C@@H](CC1)[C@H](NC(=O)c1cccc(c1)-n1cnnn1)C(=O)N1CC[C@H]2OCC(=O)[C@@H]12
: