Target
Serine/threonine-protein kinase ATR
Ligand
BDBM103471
Substrate
Meas. Tech.
Cellular Assay
IC50
13.76±n/a nM
Citation
 Foote, KMTurner, PNissink, JW Chemical compounds US Patent  US8552004 Publication Date 10/8/2013 
Target
Name:
Serine/threonine-protein kinase ATR
Synonyms:
ATR Ataxia telangiectasia and Rad3-related protein (ATR) FRP1 | Serine-protein kinase ATR
Type:
Protein
Mol. Mass.:
301404.58
Organism:
Homo sapiens (Human)
Description:
Q13535
Residue:
2644
  
Inhibitor
Name:
BDBM103471
Synonyms:
BDBM50456371 | US8552004, 2.11
Type:
Small organic molecule
Emp. Form.:
C20H24N6O2S
Mol. Mass.:
412.509
SMILES:
C[C@@H]1COCCN1c1cc(nc(n1)-c1cncc2[nH]ccc12)C1(CC1)S(C)(=N)=O
: