Target
Histone deacetylase 8
Ligand
BDBM103543
Substrate
Meas. Tech.
Enzyme Assay
IC50
141±n/a nM
Citation
 Chen, DSong, HYSun, ETYu, NZou, Y Benzimidazole derivatives: preparation and pharmaceutical applications US Patent  US8551988 Publication Date 10/8/2013 
Target
Name:
Histone deacetylase 8
Synonyms:
HD8 HDAC8_HUMAN Histone deacetylase 8 (HDAC-8) | Human HDAC8
Type:
Enzyme
Mol. Mass.:
41749.60
Organism:
Homo sapiens (Human)
Description:
Q9BY41
Residue:
377
  
Inhibitor
Name:
BDBM103543
Synonyms:
US10201527, Compound 13 US8551988, 13
Type:
Small organic molecule
Emp. Form.:
C18H18N4O3
Mol. Mass.:
338.3605
SMILES:
OCCCn1c(nc2cc(\C=C\C(=O)NO)ccc12)-c1ccccn1
: