Target
Lysine-specific demethylase 4C [1-973]
Ligand
BDBM50193145
Substrate
Meas. Tech.
In vitro Hydroxylation Assays for PHD2 (AlphaScreen)
pH
7.5±0
IC50
>2.0e+4±n/a nM
Citation
 Chowdhury, RCandela-Lena, JIChan, MCGreenald, DJYeoh, KKTian, YMMcDonough, MATumber, ARose, NRConejo-Garcia, ADemetriades, MMathavan, SKawamura, ALee, MKvan Eeden, FPugh, CWRatcliffe, PJSchofield, CJ Selective Small Molecule Probes for the Hypoxia Inducible Factor (HIF) Prolyl Hydroxylases. ACS Chem Biol 8:1488-96 (2013)  
Target
Name:
Lysine-specific demethylase 4C [1-973]
Synonyms:
GASC1 JMJD2C KDM4C KIAA0780
Type:
PROTEIN
Mol. Mass.:
110027.72
Organism:
Homo sapiens (Human)
Description:
Q9H3R0[1-973]
Residue:
973
  
Inhibitor
Name:
BDBM50193145
Synonyms:
2-(1-chloro-4-hydroxyisoquinoline-3-carboxamido)acetic acid Isoquinoline 3 | N-[(1-CHLORO-4-HYDROXYISOQUINOLIN-3-YL)CARBONYL]GLYCINE
Type:
Small organic molecule
Emp. Form.:
C12H9ClN2O4
Mol. Mass.:
280.664
SMILES:
OC(=O)CNC(=O)c1nc(Cl)c2ccccc2c1O
: