Target
Ectonucleotide pyrophosphatase/phosphodiesterase family member 2
Ligand
BDBM103956
Substrate
IC50
560±0.0 nM
Citation
 Kawaguchi, MOkabe, TOkudaira, SNishimasu, HIshitani, RKojima, HNureki, OAoki, JNagano, T Screening and X-ray crystal structure-based optimization of autotaxin (ENPP2) inhibitors, using a newly developed fluorescence probe. ACS Chem Biol 8:1713-21 (2013)  
Target
Name:
Ectonucleotide pyrophosphatase/phosphodiesterase family member 2
Synonyms:
Autotaxin ENPP2_MOUSE Ectonucleotide pyrophosphatase/phosphodiesterase family member 2 Npps2 | Pdnp2
Type:
PROTEIN
Mol. Mass.:
98896.47
Organism:
Mus musculus
Description:
Residue:
862
  
Inhibitor
Name:
BDBM103956
Synonyms:
ATX inhibitor 3
Type:
Small organic molecule
Emp. Form.:
C17H12ClFN2O5S
Mol. Mass.:
410.804
SMILES:
NS(=O)(=O)c1cc(ccc1Cl)C(=O)OCc1ncc(o1)-c1ccc(F)cc1
: