Target
Ectonucleotide pyrophosphatase/phosphodiesterase family member 2
Ligand
BDBM103584
Substrate
IC50
180±17 nM
Citation
 Kawaguchi, MOkabe, TOkudaira, SNishimasu, HIshitani, RKojima, HNureki, OAoki, JNagano, T Screening and X-ray crystal structure-based optimization of autotaxin (ENPP2) inhibitors, using a newly developed fluorescence probe. ACS Chem Biol 8:1713-21 (2013)  
Target
Name:
Ectonucleotide pyrophosphatase/phosphodiesterase family member 2
Synonyms:
Autotaxin ENPP2_MOUSE Ectonucleotide pyrophosphatase/phosphodiesterase family member 2 Npps2 | Pdnp2
Type:
PROTEIN
Mol. Mass.:
98896.47
Organism:
Mus musculus
Description:
Residue:
862
  
Inhibitor
Name:
BDBM103584
Synonyms:
ATX inhibitor 10 analogue 14
Type:
Small organic molecule
Emp. Form.:
C20H18Cl2N4OS
Mol. Mass.:
433.354
SMILES:
Clc1ccc(\C=C2/SC(=NC2=O)N2CCN(Cc3ccncc3)CC2)cc1Cl
: