Target
Discoidin domain-containing receptor 2
Ligand
BDBM50237710
Substrate
Meas. Tech.
EC50 Test
IC50
0.5±0.0 nM
Citation
 Kim, HGTan, LWeisberg, ELLiu, FCanning, PChoi, HGEzell, SAWu, HZhao, ZWang, JMandinova, AGriffin, JDBullock, ANLiu, QLee, SWGray, NS Discovery of a potent and selective DDR1 receptor tyrosine kinase inhibitor. ACS Chem Biol 8:2145-50 (2013)  
Target
Name:
Discoidin domain-containing receptor 2
Synonyms:
DDR2 Discoidin domain receptor 2 (DDR2) Discoidin domain-containing receptor 2 (DDR2) NTRKR3 TYRO10
Type:
Protein
Mol. Mass.:
96717.07
Organism:
Homo sapiens (Human)
Description:
Q16832
Residue:
855
  
Inhibitor
Name:
BDBM50237710
Synonyms:
4-methyl-N-[3-(4-methyl-1H-imidazol-1-yl)-5-(trifluoromethyl)phenyl]-3-[(4-pyridin-3-ylpyrimidin-2-yl)amino]benzamide AMN107 NILOTINIB | US11649218, Example Nilotinib
Type:
Small organic molecule
Emp. Form.:
C28H22F3N7O
Mol. Mass.:
529.5158
SMILES:
Cc1cn(cn1)-c1cc(NC(=O)c2ccc(C)c(Nc3nccc(n3)-c3cccnc3)c2)cc(c1)C(F)(F)F
: