Target
Androgen receptor
Ligand
BDBM104037
Substrate
Meas. Tech.
HDAC Activity Assay
Ki
9.6e+2±n/a nM
IC50
1.43e+3±n/a nM
Citation
 Gryder, BEAkbashev, MJRood, MKRaftery, EDMeyers, WMDillard, PKhan, SOyelere, AK Selectively targeting prostate cancer with antiandrogen equipped histone deacetylase inhibitors. ACS Chem Biol 8:2550-60 (2013)  
Target
Name:
Androgen receptor
Synonyms:
ANDR_HUMAN Androgen Receptor Androgen receptor/Baculoviral IAP repeat-containing protein 2 Dihydrotestosterone receptor Nuclear receptor subfamily 3 group C member 4
Type:
Receptor
Mol. Mass.:
99185.27
Organism:
Homo sapiens (Human)
Description:
CHO cells were stably transfected with human AR gene.
Residue:
920
  
Inhibitor
Name:
BDBM104037
Synonyms:
Alkyl Nilutamide HDACi analog 15f
Type:
Small organic molecule
Emp. Form.:
C28H36F3N7O4
Mol. Mass.:
591.6251
SMILES:
CC1(C)N(CCCCc2cn(CCCCCCCCC(=O)NO)nn2)C(=O)N(C1=O)c1ccc(C#N)c(c1)C(F)(F)F
: