Target
Protein disulfide-isomerase
Ligand
BDBM104046
Substrate
Meas. Tech.
PDI Inhibition Assay
pH
7±n/a
IC50
5.3e+3± 1.5e+3 nM
Comments
extracted
Citation
 Ge, JZhang, CJLi, LChong, LMWu, XHao, PSze, SKYao, SQ Small molecule probe suitable for in situ profiling and inhibition of protein disulfide isomerase. ACS Chem Biol 8:2577-85 (2013)  
Target
Name:
Protein disulfide-isomerase
Synonyms:
Cellular thyroid hormone-binding protein P4HB PDIA1 PO4DB | Protein Disulfide-Isomerase (PDI)
Type:
Protein
Mol. Mass.:
57084.91
Organism:
Homo sapiens (Human)
Description:
P07237
Residue:
508
  
Inhibitor
Name:
BDBM104046
Synonyms:
PDI inhibitor P9
Type:
Small organic molecule
Emp. Form.:
C22H22N2O6S
Mol. Mass.:
442.485
SMILES:
COc1ccc(cc1)C(=O)N[C@@H](Cc1ccc(OS(=O)(=O)C=C)cc1)C(=O)NCC#C
: