Target
HIV-1 protease
Ligand
BDBM104108
Substrate
Meas. Tech.
Inhibition Assay
Ki
0.546±0.028 nM
Citation
 Shen, YAltman, MDAli, ANalam, MNCao, HRana, TMSchiffer, CATidor, B Testing the substrate-envelope hypothesis with designed pairs of compounds. ACS Chem Biol 8:2433-41 (2013)  
Target
Name:
HIV-1 protease
Synonyms:
HIV-1 protease wild type
Type:
Protein
Mol. Mass.:
10757.68
Organism:
Human immunodeficiency virus
Description:
O90785
Residue:
99
  
Inhibitor
Name:
BDBM104108
Synonyms:
N-[(1S,2R)-3-[(Cyclohexylmethyl)[(4-methoxyphenyl)sulfonyl]amino]-2-hydroxy-1- (phenylmethyl)propyl]-3-hydroxy-benzamide (AF-77)
Type:
Small organic molecule
Emp. Form.:
C31H38N2O6S
Mol. Mass.:
566.708
SMILES:
COc1ccc(cc1)S(=O)(=O)N(C[C@@H](O)[C@H](Cc1ccccc1)NC(=O)c1cccc(O)c1)CC1CCCCC1
: