Target
MDRC4
Ligand
BDBM104108
Substrate
Meas. Tech.
Drug Susceptibility Assay
EC50
105.5±0.0 nM
Citation
 Shen, YAltman, MDAli, ANalam, MNCao, HRana, TMSchiffer, CATidor, B Testing the substrate-envelope hypothesis with designed pairs of compounds. ACS Chem Biol 8:2433-41 (2013)  
Target
Name:
MDRC4
Synonyms:
Multi-drug-resistant control strain R268 gag-pol
Type:
Protein
Mol. Mass.:
45906.94
Organism:
Human immunodeficiency virus
Description:
P12497[489-892,L499I,G505E,R530K,M535I,I543V,L552T,T563S,V571A,I582L,V623I,A650V,S656G,V663I,F665L,R671K,K689E,Q690K,Y703F,F704Y,D711E,Q739M,C750S,D765E,I766L,K761R,G784E,R799G,F802L,V833E,A860P,R865K,K869R,V880I]
Residue:
403
  
Inhibitor
Name:
BDBM104108
Synonyms:
N-[(1S,2R)-3-[(Cyclohexylmethyl)[(4-methoxyphenyl)sulfonyl]amino]-2-hydroxy-1- (phenylmethyl)propyl]-3-hydroxy-benzamide (AF-77)
Type:
Small organic molecule
Emp. Form.:
C31H38N2O6S
Mol. Mass.:
566.708
SMILES:
COc1ccc(cc1)S(=O)(=O)N(C[C@@H](O)[C@H](Cc1ccccc1)NC(=O)c1cccc(O)c1)CC1CCCCC1
: