Target
5-hydroxytryptamine receptor 6
Ligand
BDBM104408
Substrate
Meas. Tech.
Binding Assay
Ki
0.28±0.0 nM
Citation
 Guzzo, PRHenderson, AJNacro, KIsherwood, MLGhosh, AXiang, K Epiminocycloalkyl[b] indole derivatives as serotonin sub-type 6 (5-HT6) modulators and uses thereof US Patent  US8575186 Publication Date 11/5/2013 
Target
Name:
5-hydroxytryptamine receptor 6
Synonyms:
5-HT-6 5-hydroxytryptamine receptor 6 (5-HT-6) 5-hydroxytryptamine receptor 6 (5HT6) HTR6 Serotonin 6 (5-HT6) receptor | Serotonin Receptor 6
Type:
G Protein-Coupled Receptor (GPCR)
Mol. Mass.:
46968.43
Organism:
Homo sapiens (Human)
Description:
P50406
Residue:
440
  
Inhibitor
Name:
BDBM104408
Synonyms:
US8575186, 171/172 | US8575186, 188
Type:
Small organic molecule
Emp. Form.:
C22H20N2O2S2
Mol. Mass.:
408.536
SMILES:
Cn1c2CC3CCC(N3)c2c2cc(ccc12)S(=O)(=O)c1csc2ccccc12
: