Target
5-hydroxytryptamine receptor 7
Ligand
BDBM105011
Substrate
Meas. Tech.
Biological Assay
Ki
25.50±0.0 nM
Citation
 Carruthers, NIShireman, BTTran, VTJablonowski, JA Modulators of serotonin receptor US Patent  US8575364 Publication Date 11/5/2013 
Target
Name:
5-hydroxytryptamine receptor 7
Synonyms:
5-HT-7 5-HT7 5-HT7S 5-hydroxytryptamine receptor 7 5HT7R_RAT GPRFO Serotonin (5-HT) receptor | Serotonin Receptor 7
Type:
G Protein-Coupled Receptor (GPCR)
Mol. Mass.:
49852.62
Organism:
Rattus norvegicus (rat)
Description:
Rat cloned 5-HT7R.
Residue:
448
  
Inhibitor
Name:
BDBM105011
Synonyms:
US8575364, 20
Type:
Small organic molecule
Emp. Form.:
C16H14F3NO
Mol. Mass.:
293.2837
SMILES:
FC(F)(F)c1ccccc1-c1cccc(OC2CNC2)c1
: