Target
Phosphatidylinositol 4,5-bisphosphate 3-kinase catalytic subunit delta isoform
Ligand
BDBM50403068
Substrate
Meas. Tech.
Biochemical Assays
IC50
9±0.0 nM
Citation
 Fowler, KWHuang, DKesicki, EAOoi, HCOliver, ARuan, FTreiberg, JPuri, KD 6-fluoro-3-phenyl-2-[1-(9H-purin-6-ylamino)ethyl]-3H-quinazolin-4-one as an inhibitor of human phosphatidylinositol 3-kinase delta US Patent  US8586597 Publication Date 11/19/2013 
Target
Name:
Phosphatidylinositol 4,5-bisphosphate 3-kinase catalytic subunit delta isoform
Synonyms:
PI3-kinase p110 subunit delta PI3-kinase subunit p110-delta PIK3CD Phosphatidylinositol 4,5-biphosphate 3-kinase catalytic subunit delta (PIK3CD) Phosphatidylinositol 4,5-bisphosphate 3-kinase 110 kDa catalytic subunit delta (PI3K delta) Phosphatidylinositol 4,5-bisphosphate 3-kinase catalytic subunit delta (PI3Kdelta) Phosphatidylinositol 4,5-bisphosphate 3-kinase catalytic subunit delta isoform (PI3K delta) Phosphatidylinositol 4,5-bisphosphate 3-kinase catalytic subunit delta isoform (PI3K-delta) Phosphatidylinositol 4,5-bisphosphate 3-kinase catalytic subunit delta isoform (PI3Kdelta)
Type:
Enzyme Subunit
Mol. Mass.:
119489.41
Organism:
Homo sapiens (Human)
Description:
O00329
Residue:
1044
  
Inhibitor
Name:
BDBM50403068
Synonyms:
CHEMBL2216870 US9745321, CAL-101
Type:
Small organic molecule
Emp. Form.:
C22H18FN7O
Mol. Mass.:
415.423
SMILES:
CC[C@H](Nc1ncnc2nc[nH]c12)c1nc2cccc(F)c2c(=O)n1-c1ccccc1
: