Target
Microtubule-associated protein tau
Ligand
BDBM281640
Substrate
Meas. Tech.
Tau binding assay
pH
7.4±n/a
Temperature
298.15±n/a K
Ki
2.15±n/a nM
Comments
extracted
Citation
 Walji, AMHostetler, EGreshock, TJLi, JMoore, KPBennacef, IMulhearn, JSelnick, HWang, YYang, KFu, J Pyrrolo[2,3-C]pyridines as imaging agents for neurofibrilary tangles US Patent  US10022461 Publication Date 7/17/2018 
Target
Name:
Microtubule-associated protein tau
Synonyms:
MAPT MTBT1 Neurofibrillary tangle protein Paired helical filament-tau TAU_HUMAN | Tau Protein
Type:
Protein
Mol. Mass.:
78928.63
Organism:
Homo sapiens (Human)
Description:
P10636
Residue:
758
  
Inhibitor
Name:
BDBM281640
Synonyms:
US10022461, Compound 110
Type:
Small organic molecule
Emp. Form.:
C16H11FN4
Mol. Mass.:
278.2837
SMILES:
Nc1c(F)ccc2cc(ncc12)-n1ccc2ccncc12
: