Target
Mast/stem cell growth factor receptor Kit
Ligand
BDBM106561
Substrate
Meas. Tech.
Inhibition Assay (c-Kit)
IC50
1566±0.0 nM
Citation
 Singh, JGhosh, SKluge, AFPetter, RC Heterocyclic compounds and uses thereof US Patent  US8586600 Publication Date 11/19/2013 
Target
Name:
Mast/stem cell growth factor receptor Kit
Synonyms:
CD117 antigen KIT Mast/stem cell growth factor receptor Kit (cKIT) Proto-oncogene tyrosine-protein kinase Kit Stem cell growth factor receptor Tyrosine-protein kinase Kit c-kit v-kit Hardy-Zuckerman 4 feline sarcoma viral oncogene homolog
Type:
Protein
Mol. Mass.:
109869.37
Organism:
Homo sapiens (Human)
Description:
P10721
Residue:
976
  
Inhibitor
Name:
BDBM106561
Synonyms:
US8586600, III-6
Type:
Small organic molecule
Emp. Form.:
C30H28F3N7O2
Mol. Mass.:
575.5842
SMILES:
CN(C)C\C=C\C(=O)Nc1ccc(NC(=O)c2ccc(C)c(Nc3nccc(n3)-c3cccnc3)c2)cc1C(F)(F)F
: