Target
Polyunsaturated fatty acid lipoxygenase ALOX15B
Ligand
BDBM106775
Substrate
Meas. Tech.
IC50 Assay
pH
7.5±0
Temperature
296.15±0 K
IC50
>3.0e+4±n/a nM
Citation
 Mascayano, CEspinosa, VSepúlveda-Boza, SSepúlveda-Boza, EKPerry, S In vitro study of isoflavones and isoflavans as potent inhibitors of human 12- and 15-lipoxygenases. Chem Biol Drug Des 82:317-25 (2013)  
Target
Name:
Polyunsaturated fatty acid lipoxygenase ALOX15B
Synonyms:
15-LOX-2 15-Lipoxygenase-2 (15-LOX-2) ALOX15B Arachidonate 15-lipoxygenase, type II Epithelial 15-lipoxygenase-2 | LX15B_HUMAN
Type:
Protein
Mol. Mass.:
75850.40
Organism:
Homo sapiens (Human)
Description:
Residue:
676
  
Inhibitor
Name:
BDBM106775
Synonyms:
6,7‐dihydroxy‐3‐(4‐nitrophenyl)‐4H‐chromen‐4‐one IR-6
Type:
Small organic molecule
Emp. Form.:
C15H9NO6
Mol. Mass.:
299.2351
SMILES:
Oc1cc2occ(-c3ccc(cc3)[N+]([O-])=O)c(=O)c2cc1O
: