Target
ALK tyrosine kinase receptor
Ligand
BDBM107073
Substrate
Meas. Tech.
Enzyme Assay
IC50
17±n/a nM
Citation
 Chen, BJiang, TMarsilje, THMichellys, PNguyen, TNPei, WWu, BGao, ZGe, YHuang, CLi, YZhu, X Compounds and compositions as protein kinase inhibitors US Patent  US8592432 Publication Date 11/26/2013 
Target
Name:
ALK tyrosine kinase receptor
Synonyms:
ALK ALK_HUMAN CD_antigen: CD246
Type:
Protein
Mol. Mass.:
176453.10
Organism:
Homo sapiens (Human)
Description:
Q9UM73
Residue:
1620
  
Inhibitor
Name:
BDBM107073
Synonyms:
US8592432, 59
Type:
Small organic molecule
Emp. Form.:
C26H31N7O2S
Mol. Mass.:
505.635
SMILES:
CC(C)S(=O)(=O)c1ccccc1Nc1nc(Nc2ccc(cc2)C2CCNCC2)nc2n[nH]c(C)c12
: