Target
ALK tyrosine kinase receptor
Ligand
BDBM107083
Substrate
Meas. Tech.
Enzyme Assay
IC50
7±n/a nM
Citation
 Chen, BJiang, TMarsilje, THMichellys, PNguyen, TNPei, WWu, BGao, ZGe, YHuang, CLi, YZhu, X Compounds and compositions as protein kinase inhibitors US Patent  US8592432 Publication Date 11/26/2013 
Target
Name:
ALK tyrosine kinase receptor
Synonyms:
ALK ALK_HUMAN CD_antigen: CD246
Type:
Protein
Mol. Mass.:
176453.10
Organism:
Homo sapiens (Human)
Description:
Q9UM73
Residue:
1620
  
Inhibitor
Name:
BDBM107083
Synonyms:
US8592432, 69
Type:
Small organic molecule
Emp. Form.:
C33H43N7O4S
Mol. Mass.:
633.804
SMILES:
CC(C)Oc1cc(C2CCN(CC(N)=O)CC2)c(C)cc1Nc1nc(Nc2ccccc2S(=O)(=O)C(C)C)c2c(C)c[nH]c2n1
: