Target
KiSS-1 receptor
Ligand
BDBM107306
Substrate
Meas. Tech.
Binding Assay
IC50
0.71±0.0 nM
Citation
 Fujii, NOishi, STomita, K Metastin derivative and use thereof US Patent  US8592379 Publication Date 11/26/2013 
Target
Name:
KiSS-1 receptor
Synonyms:
AXOR12 G-protein coupled receptor 54 (GPR54) Hypogonadotropin-1 KISSR_HUMAN Kisspeptins receptor hOT7T175
Type:
G Protein-Coupled Receptor (GPCR)
Mol. Mass.:
42613.79
Organism:
Homo sapiens (Human)
Description:
Binding assay was performed using membranes from the CHO cell transfectants.
Residue:
398
  
Inhibitor
Name:
BDBM107306
Synonyms:
US8592379, 1
Type:
Small organic molecule
Emp. Form.:
C10H20N2O2
Mol. Mass.:
200.278
SMILES:
CNCC(=O)N[C@@H](CC(C)C)C(C)=O
: