Target
Acetyl-coenzyme A transporter 1
Ligand
BDBM107466
Substrate
Meas. Tech.
Binding Assay
pH
7.4±0
IC50
1.8±0.0 nM
Citation
 Maekawa, TIgawa, H Fused ring compound and use thereof US Patent  US8592431 Publication Date 11/26/2013 
Target
Name:
Acetyl-coenzyme A transporter 1
Synonyms:
ACATN AT1 SLC33A1
Type:
Enzyme
Mol. Mass.:
60911.27
Organism:
Homo sapiens (Human)
Description:
O00400
Residue:
549
  
Inhibitor
Name:
BDBM107466
Synonyms:
US8592431, 457
Type:
Small organic molecule
Emp. Form.:
C33H39FN8O3
Mol. Mass.:
614.713
SMILES:
CCCCc1c(Cc2ccc(cc2F)-c2ccccc2-c2nnn[nH]2)c(=O)n([C@H]2CC[C@@H](CC2)OCC(C)(C)O)c2ncnn12
: