Target
D(2) dopamine receptor
Ligand
BDBM107500
Substrate
Meas. Tech.
Biochemical Assay
Ki
529.67±0.0 nM
Citation
 Rodriguez Sarmiento, RMWichmann, J Benzodioxole piperidine compounds US Patent  US8598357 Publication Date 12/3/2013 
Target
Name:
D(2) dopamine receptor
Synonyms:
D(2) dopamine receptor DOPAMINE D2 Long DRD2 Dopamine D2 receptor Dopamine D2 receptor (D2R) Dopamine2-like | d2
Type:
Cell-surface receptors
Mol. Mass.:
50647.10
Organism:
Homo sapiens (Human)
Description:
P14416
Residue:
443
  
Inhibitor
Name:
BDBM107500
Synonyms:
US8598357, 3
Type:
Small organic molecule
Emp. Form.:
C26H38N2O5
Mol. Mass.:
458.5903
SMILES:
O=C(CC1COCCO1)N[C@H]1CC[C@H](CCN2CCC(CC2)c2cccc3OCOc23)CC1
: